Reaction Details
TargetMu-type opioid receptor
LigandBDBM50059841
Substrate/Competitorn/a
Meas. Tech.ChEMBL_523551 (CHEMBL1001565)
EC50 10±n/a nM
Citation Guerrini, RCamarda, VTrapella, CCaló, GRizzi, ARuzza, CFiorini, SMarzola, EReinscheid, RKRegoli, DSalvadori, S Further studies at neuropeptide s position 5: discovery of novel neuropeptide S receptor antagonists. J Med Chem52:4068-71 (2009) 
 
Mu-type opioid receptor
Name:Mu-type opioid receptor
Type:G Protein-Coupled Receptor (GPCR)
Mol. Mass.:44789.51
Organism:Homo sapiens (Human)
Description:P35372
Residue:400
BDBM50059841
NameBDBM50059841
Synonyms:(S)-1-[(S)-2-[2-((S)-2-{(R)-2-[(S)-2-Amino-3-(4-hydroxy-phenyl)-propionylamino]-propionylamino}-3-phenyl-propionylamino)-acetylamino]-3-(4-hydroxy-phenyl)-propionyl]-pyrrolidine-2-carboxylic acid ((S)-1-carbamoyl-2-hydroxy-ethyl)-amide 1-[2-[2-(2-{2-[2-Amino-3-(4-hydroxy-phenyl)-propionylamino]-propionylamino}-3-phenyl-propionylamino)-acetylamino]-3-(4-hydroxy-phenyl)-propionyl]-pyrrolidine-2-carboxylic acid (1-carbamoyl-2-hydroxy-ethyl)-amide 1-[2-[2-(2-{2-[2-Amino-3-(4-hydroxy-phenyl)-propionylamino]-propionylamino}-3-phenyl-propionylamino)-acetylamino]-3-(4-hydroxy-phenyl)-propionyl]-pyrrolidine-2-carboxylic acid (1-carbamoyl-2-hydroxy-ethyl)-amide(Dermorphin) DERMORPHIN H-Tyr-D-Ala-Phe-Gly-Tyr-Pro-Ser-NH2 YAFGYPS-NH2
TypeSmall organic molecule
Emp. Form.C40H50N8O10
Mol. Mass.802.8726
SMILESC[C@@H](NC(=O)[C@@H](N)Cc1ccc(O)cc1)C(=O)N[C@@H](Cc1ccccc1)C(=O)NCC(=O)N[C@@H](Cc1ccc(O)cc1)C(=O)N1CCC[C@H]1C(=O)N[C@@H](CO)C(N)=O