Reaction Details
TargetAdenosine receptor A3
LigandBDBM50413791
Substrate/Competitorn/a
Meas. Tech.ChEMBL_522126 (CHEMBL1006578)
Ki 1.62±n/a nM
Citation Sharma, SSharma, BKSharma, SKSingh, PPrabhakar, YS Topological descriptors in modeling the agonistic activity of human A3 adenosine receptor ligands: the derivatives of 2-chloro-N(6)-substituted-4'-thioadenosine-5'-uronamide. Eur J Med Chem44:1377-82 (2009) 
 
Adenosine receptor A3
Name:Adenosine receptor A3
Type:G Protein-Coupled Receptor (GPCR)
Mol. Mass.:36197.32
Organism:Homo sapiens (Human)
Description:P0DMS8
Residue:318
BDBM50413791
NameBDBM50413791
Synonyms:CHEMBL483975
TypeSmall organic molecule
Emp. Form.C16H23ClN6O4
Mol. Mass.398.845
SMILESCNc1nc(Cl)nc2n(cnc12)C1OC(C(O)C1O)C(=O)NCCC(C)C