Reaction Details
TargetSodium channel protein type 4 subunit alpha
LigandBDBM50413846
Substrate/Competitorn/a
Meas. Tech.ChEMBL_521570 (CHEMBL1004181)
EC50 28183.83±n/a nM
Citation Carrieri, AMuraglia, MCorbo, FPacifico, C 2D- and 3D-QSAR of tocainide and mexiletine analogues acting as Na(v)1.4 channel blockers. Eur J Med Chem44:1477-85 (2009) 
 
Sodium channel protein type 4 subunit alpha
Name:Sodium channel protein type 4 subunit alpha
Type:Protein
Mol. Mass.:208010.01
Organism:Homo sapiens (Human)
Description:P35499
Residue:1836
BDBM50413846
NameBDBM50413846
Synonyms:CHEMBL473706
TypeSmall organic molecule
Emp. Form.C14H20N2O
Mol. Mass.232.3214
SMILESCN1CCC[C@H]1C(=O)Nc1c(C)cccc1C