Reaction Details
TargetSodium channel protein type 4 subunit alpha
LigandBDBM50413847
Substrate/Competitorn/a
Meas. Tech.ChEMBL_521570 (CHEMBL1004181)
EC50 218776.16±n/a nM
Citation Carrieri, AMuraglia, MCorbo, FPacifico, C 2D- and 3D-QSAR of tocainide and mexiletine analogues acting as Na(v)1.4 channel blockers. Eur J Med Chem44:1477-85 (2009) 
 
Sodium channel protein type 4 subunit alpha
Name:Sodium channel protein type 4 subunit alpha
Type:Protein
Mol. Mass.:208010.01
Organism:Homo sapiens (Human)
Description:P35499
Residue:1836
BDBM50413847
NameBDBM50413847
Synonyms:CHEMBL484981
TypeSmall organic molecule
Emp. Form.C14H20N2O
Mol. Mass.232.3214
SMILESCN(C(=O)[C@H]1CCCN1)c1c(C)cccc1C