Reaction Details
TargetSodium channel protein type 4 subunit alpha
LigandBDBM50413853
Substrate/Competitorn/a
Meas. Tech.ChEMBL_521570 (CHEMBL1004181)
EC50 1698.24±n/a nM
Citation Carrieri, AMuraglia, MCorbo, FPacifico, C 2D- and 3D-QSAR of tocainide and mexiletine analogues acting as Na(v)1.4 channel blockers. Eur J Med Chem44:1477-85 (2009) 
 
Sodium channel protein type 4 subunit alpha
Name:Sodium channel protein type 4 subunit alpha
Type:Protein
Mol. Mass.:208010.01
Organism:Homo sapiens (Human)
Description:P35499
Residue:1836
BDBM50413853
NameBDBM50413853
Synonyms:CHEMBL485004
TypeSmall organic molecule
Emp. Form.C20H24N2O
Mol. Mass.308.4174
SMILESCc1cccc(C)c1NC(=O)[C@@H]1CCN(Cc2ccccc2)C1