Reaction Details
TargetSodium channel protein type 4 subunit alpha
LigandBDBM50135883
Substrate/Competitorn/a
Meas. Tech.ChEMBL_521570 (CHEMBL1004181)
EC50 22908.68±n/a nM
Citation Carrieri, AMuraglia, MCorbo, FPacifico, C 2D- and 3D-QSAR of tocainide and mexiletine analogues acting as Na(v)1.4 channel blockers. Eur J Med Chem44:1477-85 (2009) 
 
Sodium channel protein type 4 subunit alpha
Name:Sodium channel protein type 4 subunit alpha
Type:Protein
Mol. Mass.:208010.01
Organism:Homo sapiens (Human)
Description:P35499
Residue:1836
BDBM50135883
NameBDBM50135883
Synonyms:(2R)-1-(2,6-dimethylphenoxy)propan-2-amine (R)-2-(2,6-Dimethyl-phenoxy)-1-methyl-ethylamine MEXILETINE
TypeSmall organic molecule
Emp. Form.C11H17NO
Mol. Mass.179.2588
SMILESC[C@@H](N)COc1c(C)cccc1C