Reaction Details
TargetSodium channel protein type 4 subunit alpha
LigandBDBM50135886
Substrate/Competitorn/a
Meas. Tech.ChEMBL_521570 (CHEMBL1004181)
EC50 3019.95±n/a nM
Citation Carrieri, AMuraglia, MCorbo, FPacifico, C 2D- and 3D-QSAR of tocainide and mexiletine analogues acting as Na(v)1.4 channel blockers. Eur J Med Chem44:1477-85 (2009) 
 
Sodium channel protein type 4 subunit alpha
Name:Sodium channel protein type 4 subunit alpha
Type:Protein
Mol. Mass.:208010.01
Organism:Homo sapiens (Human)
Description:P35499
Residue:1836
BDBM50135886
NameBDBM50135886
Synonyms:(R)-2-(2,6-Dimethyl-phenoxy)-1-phenyl-ethylamine CHEMBL151557
TypeSmall organic molecule
Emp. Form.C16H19NO
Mol. Mass.241.3282
SMILESCc1cccc(C)c1OC[C@H](N)c1ccccc1