Reaction Details
TargetSodium channel protein type 4 subunit alpha
LigandBDBM50135881
Substrate/Competitorn/a
Meas. Tech.ChEMBL_521570 (CHEMBL1004181)
EC50 10000±n/a nM
Citation Carrieri, AMuraglia, MCorbo, FPacifico, C 2D- and 3D-QSAR of tocainide and mexiletine analogues acting as Na(v)1.4 channel blockers. Eur J Med Chem44:1477-85 (2009) 
 
Sodium channel protein type 4 subunit alpha
Name:Sodium channel protein type 4 subunit alpha
Type:Protein
Mol. Mass.:208010.01
Organism:Homo sapiens (Human)
Description:P35499
Residue:1836
BDBM50135881
NameBDBM50135881
Synonyms:(R)-2-(4-Chloro-phenoxy)-1-phenyl-ethylamine CHEMBL357719
TypeSmall organic molecule
Emp. Form.C14H14ClNO
Mol. Mass.247.72
SMILESN[C@@H](COc1ccc(Cl)cc1)c1ccccc1