Reaction Details
TargetSodium channel protein type 4 subunit alpha
LigandBDBM50135878
Substrate/Competitorn/a
Meas. Tech.ChEMBL_521570 (CHEMBL1004181)
EC50 1000±n/a nM
Citation Carrieri, AMuraglia, MCorbo, FPacifico, C 2D- and 3D-QSAR of tocainide and mexiletine analogues acting as Na(v)1.4 channel blockers. Eur J Med Chem44:1477-85 (2009) 
 
Sodium channel protein type 4 subunit alpha
Name:Sodium channel protein type 4 subunit alpha
Type:Protein
Mol. Mass.:208010.01
Organism:Homo sapiens (Human)
Description:P35499
Residue:1836
BDBM50135878
NameBDBM50135878
Synonyms:(R)-1-Phenyl-2-o-tolyloxy-ethylamine CHEMBL149832
TypeSmall organic molecule
Emp. Form.C15H17NO
Mol. Mass.227.3016
SMILESCc1ccccc1OC[C@H](N)c1ccccc1