Reaction Details
TargetSodium channel protein type 4 subunit alpha
LigandBDBM50413863
Substrate/Competitorn/a
Meas. Tech.ChEMBL_521570 (CHEMBL1004181)
EC50 208929.61±n/a nM
Citation Carrieri, AMuraglia, MCorbo, FPacifico, C 2D- and 3D-QSAR of tocainide and mexiletine analogues acting as Na(v)1.4 channel blockers. Eur J Med Chem44:1477-85 (2009) 
 
Sodium channel protein type 4 subunit alpha
Name:Sodium channel protein type 4 subunit alpha
Type:Protein
Mol. Mass.:208010.01
Organism:Homo sapiens (Human)
Description:P35499
Residue:1836
BDBM50413863
NameBDBM50413863
Synonyms:CHEMBL2021482
TypeSmall organic molecule
Emp. Form.C9H12O2
Mol. Mass.152.1904
SMILESC[C@@H](O)COc1ccccc1