Reaction Details
TargetRho-associated protein kinase 1
LigandBDBM50350908
Substrate/Competitorn/a
Meas. Tech.ChEMBL_502285 (CHEMBL983956)
IC50<10000±n/a nM
Citation Liddle, JBamborough, PBarker, MDCampos, SCousins, RPCutler, GJHobbs, HHolmes, DSIoannou, CMellor, GWMorse, MAPayne, JJPritchard, JMSmith, KJTape, DTWhitworth, CWilliamson, RA 4-Phenyl-7-azaindoles as potent and selective IKK2 inhibitors. Bioorg Med Chem Lett19:2504-8 (2009) 
 
Rho-associated protein kinase 1
Name:Rho-associated protein kinase 1
Type:Serine/threonine-protein kinase
Mol. Mass.:158156.77
Organism:Homo sapiens (Human)
Description:Q13464
Residue:1354
BDBM50350908
NameBDBM50350908
Synonyms:CHEMBL520308
TypeSmall organic molecule
Emp. Form.C17H19N3O3S
Mol. Mass.345.416
SMILESCN(CCO)S(=O)(=O)c1ccc(cc1)-c1ccnc2[nH]c(C)cc12