Reaction Details
TargetSubstance-P receptor
LigandBDBM50413891
Substrate/Competitorn/a
Meas. Tech.ChEMBL_498162 (CHEMBL979852)
Ki 0.224±n/a nM
Citation Di Fabio, RGriffante, CAlvaro, GPentassuglia, GPizzi, DADonati, DRossi, TGuercio, GMattioli, MCimarosti, ZMarchioro, CProvera, SZonzini, LMontanari, DMelotto, SGerrard, PATrist, DGRatti, ECorsi, M Discovery process and pharmacological characterization of 2-(S)-(4-fluoro-2-methylphenyl)piperazine-1-carboxylic acid [1-(R)-(3,5-bis-trifluoromethylphenyl)ethyl]methylamide (vestipitant) as a potent, selective, and orally active NK1 receptor antagonist. J Med Chem52:3238-47 (2009) 
 
Substance-P receptor
Name:Substance-P receptor
Type:G Protein-Coupled Receptor (GPCR)
Mol. Mass.:46254.43
Organism:Homo sapiens (Human)
Description:P25103
Residue:407
BDBM50413891
NameBDBM50413891
Synonyms:VESTIPITANT
TypeSmall organic molecule
Emp. Form.C23H24F7N3O
Mol. Mass.491.445
SMILESC[C@@H](N(C)C(=O)N1CCNC[C@@H]1c1ccc(F)cc1C)c1cc(cc(c1)C(F)(F)F)C(F)(F)F