Reaction Details
TargetP2X purinoceptor 7
LigandBDBM50234965
Substrate/Competitorn/a
Meas. Tech.ChEMBL_498215 (CHEMBL968795)
IC50 39.81±n/a nM
Citation Perez-Medrano, ADonnelly-Roberts, DLHonore, PHsieh, GCNamovic, MTPeddi, SShuai, QWang, YFaltynek, CRJarvis, MFCarroll, WA Discovery and biological evaluation of novel cyanoguanidine P2X(7) antagonists with analgesic activity in a rat model of neuropathic pain. J Med Chem52:3366-76 (2009) 
 
P2X purinoceptor 7
Name:P2X purinoceptor 7
Type:Protein
Mol. Mass.:68602.85
Organism:Homo sapiens (Human)
Description:Q99572
Residue:595
BDBM50234965
NameBDBM50234965
Synonyms:A-740003 N-(1-(2-cyano-3-(quinolin-5-yl)guanidino)-2,2-dimethylpropyl)-2-(3,4-dimethoxyphenyl)acetamide | N-(1-{[(Cyanoimino)(5-quinolinylamino)methyl]amino}-2,2-dimethylpropyl)-2-(3,4-dimethoxyphenyl)acetamide
TypeSmall organic molecule
Emp. Form.C26H30N6O3
Mol. Mass.474.5548
SMILESCOc1ccc(CC(=O)NC(N=C(NC#N)Nc2cccc3ncccc23)C(C)(C)C)cc1OC