Reaction Details
TargetCytochrome P450 2A5
LigandBDBM50159257
Substrate/Competitorn/a
Meas. Tech.ChEMBL_572014 (CHEMBL1023676)
IC50 1698±n/a nM
Citation Roy, KRoy, PP Exploring QSAR and QAAR for inhibitors of cytochrome P450 2A6 and 2A5 enzymes using GFA and G/PLS techniques. Eur J Med Chem44:1941-51 (2009) 
 
Cytochrome P450 2A5
Name:Cytochrome P450 2A5
Type:PROTEIN
Mol. Mass.:56752.73
Organism:Mus musculus
Description:ChEMBL_572014
Residue:494
BDBM50159257
NameBDBM50159257
Synonyms:2,6-DMN CHEMBL194983
TypeSmall organic molecule
Emp. Form.C12H12
Mol. Mass.156.2237
SMILESCc1ccc2cc(C)ccc2c1