Reaction Details
TargetCannabinoid receptor 2
LigandBDBM50265756
Substrate/Competitorn/a
Meas. Tech.ChEMBL_570539 (CHEMBL1026911)
Ki 39.99±n/a nM
Citation De Freitas, GBda Silva, LLRomeiro, NCFraga, CA Development of CoMFA and CoMSIA models of affinity and selectivity for indole ligands of cannabinoid CB1 and CB2 receptors. Eur J Med Chem44:2482-96 (2009) 
 
Cannabinoid receptor 2
Name:Cannabinoid receptor 2
Type:G Protein-Coupled Receptor (GPCR)
Mol. Mass.:39690.94
Organism:Homo sapiens (Human)
Description:P34972
Residue:360
BDBM50265756
NameBDBM50265756
Synonyms:(2-methoxynaphthalen-1-yl)(2-methyl-1-pentyl-1H-indol-3-yl)methanone JWH-268
TypeSmall organic molecule
Emp. Form.C26H27NO2
Mol. Mass.385.4981
SMILESCCCCCn1c(C)c(C(=O)c2c(OC)ccc3ccccc23)c2ccccc12