Reaction Details
TargetCannabinoid receptor 1
LigandBDBM50265747
Substrate/Competitorn/a
Meas. Tech.ChEMBL_570538 (CHEMBL1026910)
Ki 1054.39±n/a nM
Citation De Freitas, GBda Silva, LLRomeiro, NCFraga, CA Development of CoMFA and CoMSIA models of affinity and selectivity for indole ligands of cannabinoid CB1 and CB2 receptors. Eur J Med Chem44:2482-96 (2009) 
 
Cannabinoid receptor 1
Name:Cannabinoid receptor 1
Type:G Protein-Coupled Receptor (GPCR)
Mol. Mass.:52856.55
Organism:Rattus norvegicus (rat)
Description:P20272
Residue:473
BDBM50265747
NameBDBM50265747
Synonyms:(4-methylnaphthalen-1-yl)(1-propyl-1H-indol-3-yl)methanone JWH-120
TypeSmall organic molecule
Emp. Form.C23H21NO
Mol. Mass.327.4189
SMILESCCCn1cc(C(=O)c2ccc(C)c3ccccc23)c2ccccc12