Reaction Details
TargetSerine/threonine-protein kinase Chk1
LigandBDBM50214562
Substrate/Competitorn/a
Meas. Tech.ChEMBL_570759 (CHEMBL1026934)
Ki 0.100000±n/a nM
Citation Brown, SPMuchmore, SW Large-scale application of high-throughput molecular mechanics with Poisson-Boltzmann surface area for routine physics-based scoring of protein-ligand complexes. J Med Chem52:3159-65 (2009) 
 
Serine/threonine-protein kinase Chk1
Name:Serine/threonine-protein kinase Chk1
Type:Enzyme Catalytic Domain
Mol. Mass.:54443.02
Organism:Homo sapiens (Human)
Description:gi_166295192
Residue:476
BDBM50214562
NameBDBM50214562
Synonyms:2-(3-(4'-hydroxybiphenyl-4-yl)-7-methoxy-1,4-dihydroindeno[1,2-c]pyrazol-6-yloxy)propane-1,3-diol CHEMBL248194
TypeSmall organic molecule
Emp. Form.C26H24N2O5
Mol. Mass.444.4792
SMILESCOc1cc-2c(Cc3c(n[nH]c-23)-c2ccc(cc2)-c2ccc(O)cc2)cc1OC(CO)CO