Reaction Details
TargetSerine/threonine-protein kinase Chk1
LigandBDBM50414096
Substrate/Competitorn/a
Meas. Tech.ChEMBL_570759 (CHEMBL1026934)
Ki 5±n/a nM
Citation Brown, SPMuchmore, SW Large-scale application of high-throughput molecular mechanics with Poisson-Boltzmann surface area for routine physics-based scoring of protein-ligand complexes. J Med Chem52:3159-65 (2009) 
 
Serine/threonine-protein kinase Chk1
Name:Serine/threonine-protein kinase Chk1
Type:Enzyme Catalytic Domain
Mol. Mass.:54443.02
Organism:Homo sapiens (Human)
Description:gi_166295192
Residue:476
BDBM50414096
NameBDBM50414096
Synonyms:CHEMBL550820
TypeSmall organic molecule
Emp. Form.C24H25N3O4
Mol. Mass.419.473
SMILESCOc1cc-2c(cc1OCCCN1CCOCC1)C(=O)c1c(n[nH]c-21)-c1ccccc1