Reaction Details
TargetSerine/threonine-protein kinase Chk1
LigandBDBM15247
Substrate/Competitorn/a
Meas. Tech.ChEMBL_570759 (CHEMBL1026934)
Ki 7.9±n/a nM
Citation Brown, SPMuchmore, SW Large-scale application of high-throughput molecular mechanics with Poisson-Boltzmann surface area for routine physics-based scoring of protein-ligand complexes. J Med Chem52:3159-65 (2009) 
 
Serine/threonine-protein kinase Chk1
Name:Serine/threonine-protein kinase Chk1
Type:Enzyme Catalytic Domain
Mol. Mass.:54443.02
Organism:Homo sapiens (Human)
Description:gi_166295192
Residue:476
BDBM15247
NameBDBM15247
Synonyms:7-chloro-11,17-dioxa-2,4,20,22-tetraazatricyclo[16.3.1.0^{5,10}]docosa-1(21),5(10),6,8,18(22),19-hexaen-3-one | macrocyclic inhibitor 5a
TypeSmall organic molecule
Emp. Form.C16H17ClN4O3
Mol. Mass.348.784
SMILESClc1ccc2OCCCCCOc3cncc(NC(=O)Nc2c1)n3