Reaction Details
TargetSerine/threonine-protein kinase Chk1
LigandBDBM50414074
Substrate/Competitorn/a
Meas. Tech.ChEMBL_570759 (CHEMBL1026934)
Ki 2.5±n/a nM
Citation Brown, SPMuchmore, SW Large-scale application of high-throughput molecular mechanics with Poisson-Boltzmann surface area for routine physics-based scoring of protein-ligand complexes. J Med Chem52:3159-65 (2009) 
 
Serine/threonine-protein kinase Chk1
Name:Serine/threonine-protein kinase Chk1
Type:Enzyme Catalytic Domain
Mol. Mass.:54443.02
Organism:Homo sapiens (Human)
Description:gi_166295192
Residue:476
BDBM50414074
NameBDBM50414074
Synonyms:CHEMBL559425
TypeSmall organic molecule
Emp. Form.C25H25N3O3
Mol. Mass.415.4843
SMILESCOc1cccc(c1)-c1ccc2c(Nc3ccc(CCC(=O)N(C)C)cc3NC2=O)c1