Reaction Details
TargetUrokinase-type plasminogen activator
LigandBDBM50138670
Substrate/Competitorn/a
Meas. Tech.ChEMBL_570757 (CHEMBL1026932)
Ki 631±n/a nM
Citation Brown, SPMuchmore, SW Large-scale application of high-throughput molecular mechanics with Poisson-Boltzmann surface area for routine physics-based scoring of protein-ligand complexes. J Med Chem52:3159-65 (2009) 
 
Urokinase-type plasminogen activator
Name:Urokinase-type plasminogen activator
Type:Enzyme
Mol. Mass.:48528.62
Organism:Homo sapiens (Human)
Description:P00749
Residue:431
BDBM50138670
NameBDBM50138670
Synonyms:6-Carbamimidoyl-naphthalene-2-carboxylic acid phenylamide 6-carbamimidoyl-N-phenyl-2-naphthamide uPa_7
TypeSmall organic molecule
Emp. Form.C18H15N3O
Mol. Mass.289.3312
SMILESNC(=N)c1ccc2cc(ccc2c1)C(=O)Nc1ccccc1