Reaction Details
TargetUrokinase-type plasminogen activator
LigandBDBM50147084
Substrate/Competitorn/a
Meas. Tech.ChEMBL_570757 (CHEMBL1026932)
Ki 100±n/a nM
Citation Brown, SPMuchmore, SW Large-scale application of high-throughput molecular mechanics with Poisson-Boltzmann surface area for routine physics-based scoring of protein-ligand complexes. J Med Chem52:3159-65 (2009) 
 
Urokinase-type plasminogen activator
Name:Urokinase-type plasminogen activator
Type:Enzyme
Mol. Mass.:48528.62
Organism:Homo sapiens (Human)
Description:P00749
Residue:431
BDBM50147084
NameBDBM50147084
Synonyms:6-Carbamimidoyl-4-(tetrahydro-furan-3-yl)-naphthalene-2-carboxylic acid phenylamide CHEMBL105395
TypeSmall organic molecule
Emp. Form.C22H21N3O2
Mol. Mass.359.421
SMILESNC(=N)c1ccc2cc(cc(C3CCOC3)c2c1)C(=O)Nc1ccccc1