Reaction Details
TargetP2X purinoceptor 7
LigandBDBM50414307
Substrate/Competitorn/a
Meas. Tech.ChEMBL_574385 (CHEMBL1028693)
IC50 0.0794±n/a nM
Citation Guile, SDAlcaraz, LBirkinshaw, TNBowers, KCEbden, MRFurber, MStocks, MJ Antagonists of the P2X(7) receptor. From lead identification to drug development. J Med Chem52:3123-41 (2009) 
 
P2X purinoceptor 7
Name:P2X purinoceptor 7
Type:Protein
Mol. Mass.:68602.85
Organism:Homo sapiens (Human)
Description:Q99572
Residue:595
BDBM50414307
NameBDBM50414307
Synonyms:CHEMBL560506
TypeSmall organic molecule
Emp. Form.C24H28ClN3O3
Mol. Mass.441.95
SMILESCC(C(N)=O)n1ccc2c(NC(=O)CC34CC5CC(CC(C5)C3)C4)c(Cl)ccc2c1=O