Reaction Details
TargetHistamine H3 receptor
LigandBDBM50414390
Substrate/Competitorn/a
Meas. Tech.ChEMBL_576568 (CHEMBL1034549)
Ki 5.01±n/a nM
Citation Lim, HDIstyastono, EPvan de Stolpe, ARomeo, GGobbi, SSchepers, MLahaye, RMenge, WMZuiderveld, OPJongejan, ASmits, RABakker, RAHaaksma, EELeurs, Rde Esch, IJ Clobenpropit analogs as dual activity ligands for the histamine H3 and H4 receptors: synthesis, pharmacological evaluation, and cross-target QSAR studies. Bioorg Med Chem17:3987-94 (2009) 
 
Histamine H3 receptor
Name:Histamine H3 receptor
Type:G Protein-Coupled Receptor (GPCR)
Mol. Mass.:48691.47
Organism:Homo sapiens (Human)
Description:Binding assays were using CHO cells stably expressing hH3R receptors.
Residue:445
BDBM50414390
NameBDBM50414390
Synonyms:CHEMBL1202328
TypeSmall organic molecule
Emp. Form.C14H17FN4S
Mol. Mass.292.375
SMILESNC(SCCCc1cnc[nH]1)=NCc1ccc(F)cc1