Reaction Details
TargetAlpha-1A adrenergic receptor
LigandBDBM50403649
Substrate/Competitorn/a
Meas. Tech.ChEMBL_574168 (CHEMBL1060369)
Ki 5.5±n/a nM
Citation Giardinà, DMartarelli, DSagratini, GAngeli, PBallinari, DGulini, UMelchiorre, CPoggesi, EPompei, P Doxazosin-related alpha1-adrenoceptor antagonists with prostate antitumor activity. J Med Chem52:4951-4 (2009) 
 
Alpha-1A adrenergic receptor
Name:Alpha-1A adrenergic receptor
Type:Cell-surface receptors
Mol. Mass.:51511.67
Organism:Homo sapiens (Human)
Description:P35348
Residue:466
BDBM50403649
NameBDBM50403649
Synonyms:CYCLAZOSIN
TypeSmall organic molecule
Emp. Form.C23H27N5O4
Mol. Mass.437.4916
SMILESCOc1cc2nc(nc(N)c2cc1OC)N1CCN([C@H]2CCCC[C@@H]12)C(=O)c1ccco1