Reaction Details
TargetAlpha-1B adrenergic receptor
LigandBDBM50414398
Substrate/Competitorn/a
Meas. Tech.ChEMBL_574169 (CHEMBL1060370)
Ki 22.39±n/a nM
Citation Giardinà, DMartarelli, DSagratini, GAngeli, PBallinari, DGulini, UMelchiorre, CPoggesi, EPompei, P Doxazosin-related alpha1-adrenoceptor antagonists with prostate antitumor activity. J Med Chem52:4951-4 (2009) 
 
Alpha-1B adrenergic receptor
Name:Alpha-1B adrenergic receptor
Type:Enzyme
Mol. Mass.:56862.13
Organism:Homo sapiens (Human)
Description:P35368
Residue:520
BDBM50414398
NameBDBM50414398
Synonyms:CHEMBL549764
TypeSmall organic molecule
Emp. Form.C27H31N5O5
Mol. Mass.505.5655
SMILESCOc1cc2nc(nc(N)c2cc1OC)N1CCN([C@H]2CCCC[C@H]12)C(=O)C1COc2ccccc2O1