Reaction Details
TargetAlpha-1B adrenergic receptor
LigandBDBM50414399
Substrate/Competitorn/a
Meas. Tech.ChEMBL_574169 (CHEMBL1060370)
Ki 0.933±n/a nM
Citation Giardinà, DMartarelli, DSagratini, GAngeli, PBallinari, DGulini, UMelchiorre, CPoggesi, EPompei, P Doxazosin-related alpha1-adrenoceptor antagonists with prostate antitumor activity. J Med Chem52:4951-4 (2009) 
 
Alpha-1B adrenergic receptor
Name:Alpha-1B adrenergic receptor
Type:Enzyme
Mol. Mass.:56862.13
Organism:Homo sapiens (Human)
Description:P35368
Residue:520
BDBM50414399
NameBDBM50414399
Synonyms:CHEMBL561851
TypeSmall organic molecule
Emp. Form.C27H35N5O5
Mol. Mass.509.5973
SMILESCOc1cc2nc(nc(N)c2cc1OC)N(C)CCCCCCN(C)C(=O)C1COc2ccccc2O1