Reaction Details
TargetAlpha-1B adrenergic receptor
LigandBDBM50403649
Substrate/Competitorn/a
Meas. Tech.ChEMBL_574169 (CHEMBL1060370)
Ki 0.324±n/a nM
Citation Giardinà, DMartarelli, DSagratini, GAngeli, PBallinari, DGulini, UMelchiorre, CPoggesi, EPompei, P Doxazosin-related alpha1-adrenoceptor antagonists with prostate antitumor activity. J Med Chem52:4951-4 (2009) 
 
Alpha-1B adrenergic receptor
Name:Alpha-1B adrenergic receptor
Type:Enzyme
Mol. Mass.:56862.13
Organism:Homo sapiens (Human)
Description:P35368
Residue:520
BDBM50403649
NameBDBM50403649
Synonyms:CYCLAZOSIN
TypeSmall organic molecule
Emp. Form.C23H27N5O4
Mol. Mass.437.4916
SMILESCOc1cc2nc(nc(N)c2cc1OC)N1CCN([C@H]2CCCC[C@@H]12)C(=O)c1ccco1