Reaction Details
TargetD(3) dopamine receptor
LigandBDBM50414442
Substrate/Competitorn/a
Meas. Tech.ChEMBL_577522 (CHEMBL1057874)
Ki 3.98±n/a nM
Citation Micheli, FHolmes, IArista, LBonanomi, GBraggio, SCardullo, FDi Fabio, RDonati, DGentile, GHamprecht, DTerreni, SHeidbreder, CSavoia, CGriffante, CWorby, A Dopamine D(3) receptor antagonists: The quest for a potentially selective PET ligand. Part two: Lead optimization. Bioorg Med Chem Lett19:4011-3 (2009) 
 
D(3) dopamine receptor
Name:D(3) dopamine receptor
Type:n/a
Mol. Mass.:44243.43
Organism:Homo sapiens (Human)
Description:n/a
Residue:400
BDBM50414442
NameBDBM50414442
Synonyms:CHEMBL571456
TypeSmall organic molecule
Emp. Form.C19H27N5O
Mol. Mass.341.4506
SMILESCC(C)N1CCN(CCN2CCN(C2=O)c2cccc(c2)C#N)CC1