Reaction Details
TargetD(3) dopamine receptor
LigandBDBM50414403
Substrate/Competitorn/a
Meas. Tech.ChEMBL_582203 (CHEMBL1059863)
Ki 2.51±n/a nM
Citation Holmes, IPMicheli, FGaines, SLorthioir, OWatson, SPFabio, RDGentile, GHeidbreder, CSavoia, CWorby, A Dopamine D3 receptor antagonists: the quest for a potentially selective PET ligand. Part one: lead identification. Bioorg Med Chem Lett19:4799-801 (2009) 
 
D(3) dopamine receptor
Name:D(3) dopamine receptor
Type:n/a
Mol. Mass.:44243.43
Organism:Homo sapiens (Human)
Description:n/a
Residue:400
BDBM50414403
NameBDBM50414403
Synonyms:CHEMBL560177
TypeSmall organic molecule
Emp. Form.C19H20ClN3O
Mol. Mass.341.835
SMILESClc1cccc(c1)N1CCN(CCN2Cc3ccccc3C2)C1=O