Reaction Details
TargetD(3) dopamine receptor
LigandBDBM50414578
Substrate/Competitorn/a
Meas. Tech.ChEMBL_582203 (CHEMBL1059863)
Ki 1.58±n/a nM
Citation Holmes, IPMicheli, FGaines, SLorthioir, OWatson, SPFabio, RDGentile, GHeidbreder, CSavoia, CWorby, A Dopamine D3 receptor antagonists: the quest for a potentially selective PET ligand. Part one: lead identification. Bioorg Med Chem Lett19:4799-801 (2009) 
 
D(3) dopamine receptor
Name:D(3) dopamine receptor
Type:n/a
Mol. Mass.:44243.43
Organism:Homo sapiens (Human)
Description:n/a
Residue:400
BDBM50414578
NameBDBM50414578
Synonyms:CHEMBL558058
TypeSmall organic molecule
Emp. Form.C23H32F3N3O
Mol. Mass.423.5149
SMILESCN(CCN1CCN(C1=O)c1cccc(c1)C(F)(F)F)C[C@@]12CC[C@@H](CC1)C2(C)C