Reaction Details
TargetSodium-dependent noradrenaline transporter
LigandBDBM50414584
Substrate/Competitorn/a
Meas. Tech.ChEMBL_582671 (CHEMBL1051045)
Ki 12.59±n/a nM
Citation Lucas, MCCarter, DSCai, HYLee, EKSchoenfeld, RCSteiner, SVilla, MWeikert, RJIyer, PS Novel, achiral aminoheterocycles as selective monoamine reuptake inhibitors. Bioorg Med Chem Lett19:4630-3 (2009) 
 
Sodium-dependent noradrenaline transporter
Name:Sodium-dependent noradrenaline transporter
Type:Multi-pass membrane protein
Mol. Mass.:69337.72
Organism:Homo sapiens (Human)
Description:P23975
Residue:617
BDBM50414584
NameBDBM50414584
Synonyms:CHEMBL557119
TypeSmall organic molecule
Emp. Form.C20H22FN3
Mol. Mass.323.4072
SMILESFc1ccccc1CN(C1CCNCC1)c1ccc2[nH]ccc2c1