Reaction Details
TargetSodium-dependent noradrenaline transporter
LigandBDBM84745
Substrate/Competitorn/a
Meas. Tech.ChEMBL_582671 (CHEMBL1051045)
Ki 7.94±n/a nM
Citation Lucas, MCCarter, DSCai, HYLee, EKSchoenfeld, RCSteiner, SVilla, MWeikert, RJIyer, PS Novel, achiral aminoheterocycles as selective monoamine reuptake inhibitors. Bioorg Med Chem Lett19:4630-3 (2009) 
 
Sodium-dependent noradrenaline transporter
Name:Sodium-dependent noradrenaline transporter
Type:Multi-pass membrane protein
Mol. Mass.:69337.72
Organism:Homo sapiens (Human)
Description:P23975
Residue:617
BDBM84745
NameBDBM84745
Synonyms:CAS_136434-34-9 LY-248686 USRE49340, Rank 5
TypeSmall organic molecule
Emp. Form.C18H19NOS
Mol. Mass.297.415
SMILESCNCC[C@H](Oc1cccc2ccccc12)c1cccs1