Reaction Details
TargetSodium-dependent serotonin transporter
LigandBDBM50414597
Substrate/Competitorn/a
Meas. Tech.ChEMBL_582670 (CHEMBL1051044)
Ki 1.58±n/a nM
Citation Lucas, MCCarter, DSCai, HYLee, EKSchoenfeld, RCSteiner, SVilla, MWeikert, RJIyer, PS Novel, achiral aminoheterocycles as selective monoamine reuptake inhibitors. Bioorg Med Chem Lett19:4630-3 (2009) 
 
Sodium-dependent serotonin transporter
Name:Sodium-dependent serotonin transporter
Type:Multi-pass membrane protein
Mol. Mass.:70322.51
Organism:Homo sapiens (Human)
Description:P31645
Residue:630
BDBM50414597
NameBDBM50414597
Synonyms:CHEMBL550870
TypeSmall organic molecule
Emp. Form.C21H25N3O
Mol. Mass.335.4427
SMILESCOc1cccc(CN(C2CCNCC2)c2ccc3[nH]ccc3c2)c1