Reaction Details
TargetSodium-dependent serotonin transporter
LigandBDBM50414599
Substrate/Competitorn/a
Meas. Tech.ChEMBL_582670 (CHEMBL1051044)
Ki 2.51±n/a nM
Citation Lucas, MCCarter, DSCai, HYLee, EKSchoenfeld, RCSteiner, SVilla, MWeikert, RJIyer, PS Novel, achiral aminoheterocycles as selective monoamine reuptake inhibitors. Bioorg Med Chem Lett19:4630-3 (2009) 
 
Sodium-dependent serotonin transporter
Name:Sodium-dependent serotonin transporter
Type:Multi-pass membrane protein
Mol. Mass.:70322.51
Organism:Homo sapiens (Human)
Description:P31645
Residue:630
BDBM50414599
NameBDBM50414599
Synonyms:CHEMBL564285
TypeSmall organic molecule
Emp. Form.C21H22N4
Mol. Mass.330.4262
SMILESN#Cc1ccc(CN(C2CCNCC2)c2ccc3[nH]ccc3c2)cc1