Reaction Details
TargetSodium-dependent serotonin transporter
LigandBDBM50414592
Substrate/Competitorn/a
Meas. Tech.ChEMBL_582670 (CHEMBL1051044)
Ki 6.31±n/a nM
Citation Lucas, MCCarter, DSCai, HYLee, EKSchoenfeld, RCSteiner, SVilla, MWeikert, RJIyer, PS Novel, achiral aminoheterocycles as selective monoamine reuptake inhibitors. Bioorg Med Chem Lett19:4630-3 (2009) 
 
Sodium-dependent serotonin transporter
Name:Sodium-dependent serotonin transporter
Type:Multi-pass membrane protein
Mol. Mass.:70322.51
Organism:Homo sapiens (Human)
Description:P31645
Residue:630
BDBM50414592
NameBDBM50414592
Synonyms:CHEMBL560536
TypeSmall organic molecule
Emp. Form.C20H23N3
Mol. Mass.305.4167
SMILESC(N(C1CCCNC1)c1ccc2[nH]ccc2c1)c1ccccc1