Reaction Details
TargetSodium-dependent noradrenaline transporter
LigandBDBM50414600
Substrate/Competitorn/a
Meas. Tech.ChEMBL_582671 (CHEMBL1051045)
Ki 10±n/a nM
Citation Lucas, MCCarter, DSCai, HYLee, EKSchoenfeld, RCSteiner, SVilla, MWeikert, RJIyer, PS Novel, achiral aminoheterocycles as selective monoamine reuptake inhibitors. Bioorg Med Chem Lett19:4630-3 (2009) 
 
Sodium-dependent noradrenaline transporter
Name:Sodium-dependent noradrenaline transporter
Type:Multi-pass membrane protein
Mol. Mass.:69337.72
Organism:Homo sapiens (Human)
Description:P23975
Residue:617
BDBM50414600
NameBDBM50414600
Synonyms:CHEMBL570317
TypeSmall organic molecule
Emp. Form.C21H22N4
Mol. Mass.330.4262
SMILESN#Cc1cccc(CN(C2CCNCC2)c2ccc3[nH]ccc3c2)c1