Reaction Details
TargetGlucocorticoid receptor
LigandBDBM50414604
Substrate/Competitorn/a
Meas. Tech.ChEMBL_580474 (CHEMBL1052501)
IC50 0.079±n/a nM
Citation Biggadike, KCaivano, MClackers, MCoe, DMHardy, GWHumphreys, DJones, HTHouse, DMiles-Williams, ASkone, PAUings, IWeller, VMcLay, IMMacdonald, SJ Highly tractable, sub-nanomolar non-steroidal glucocorticoid receptor agonists. Bioorg Med Chem Lett19:4846-50 (2009) 
 
Glucocorticoid receptor
Name:Glucocorticoid receptor
Type:Enzyme
Mol. Mass.:85656.87
Organism:Homo sapiens (Human)
Description:P04150
Residue:777
BDBM50414604
NameBDBM50414604
Synonyms:CHEMBL551816
TypeSmall organic molecule
Emp. Form.C26H22Cl2F4N4O2
Mol. Mass.569.378
SMILESCCN(CC(O)(CNc1cccc2n(ncc12)-c1ccc(F)cc1)C(F)(F)F)C(=O)c1c(Cl)cccc1Cl