Reaction Details
TargetProcathepsin L
LigandBDBM50414637
Substrate/Competitorn/a
Meas. Tech.ChEMBL_581585 (CHEMBL1062472)
IC50 15.85±n/a nM
Citation Bethel, PAGerhardt, SJones, EVKenny, PWKaroutchi, GIMorley, ADOldham, KRankine, NAugustin, MKrapp, SSimader, HSteinbacher, S Design of selective Cathepsin inhibitors. Bioorg Med Chem Lett19:4622-5 (2009) 
 
Procathepsin L
Name:Procathepsin L
Type:Enzyme
Mol. Mass.:37557.19
Organism:Homo sapiens (Human)
Description:Purchased from Calbiochem (San Diego, CA).
Residue:333
BDBM50414637
NameBDBM50414637
Synonyms:CHEMBL562915
TypeSmall organic molecule
Emp. Form.C22H25N7O3
Mol. Mass.435.479
SMILESCn1nc(cc1C(=O)NC(Cc1cccc(c1)-c1nnco1)C(=O)NCC#N)C(C)(C)C