Reaction Details
TargetCathepsin K
LigandBDBM50414639
Substrate/Competitorn/a
Meas. Tech.ChEMBL_581588 (CHEMBL1062475)
IC50 63.1±n/a nM
Citation Bethel, PAGerhardt, SJones, EVKenny, PWKaroutchi, GIMorley, ADOldham, KRankine, NAugustin, MKrapp, SSimader, HSteinbacher, S Design of selective Cathepsin inhibitors. Bioorg Med Chem Lett19:4622-5 (2009) 
 
Cathepsin K
Name:Cathepsin K
Type:Enzyme
Mol. Mass.:36975.68
Organism:Homo sapiens (Human)
Description:P43235
Residue:329
BDBM50414639
NameBDBM50414639
Synonyms:CHEMBL550872
TypeSmall organic molecule
Emp. Form.C23H27N7O3
Mol. Mass.449.5056
SMILESCc1nnc(o1)-c1cccc(CC(NC(=O)c2cc(nn2C)C(C)(C)C)C(=O)NCC#N)c1