Reaction Details
TargetProcathepsin L
LigandBDBM50414641
Substrate/Competitorn/a
Meas. Tech.ChEMBL_581585 (CHEMBL1062472)
IC50 3.98±n/a nM
Citation Bethel, PAGerhardt, SJones, EVKenny, PWKaroutchi, GIMorley, ADOldham, KRankine, NAugustin, MKrapp, SSimader, HSteinbacher, S Design of selective Cathepsin inhibitors. Bioorg Med Chem Lett19:4622-5 (2009) 
 
Procathepsin L
Name:Procathepsin L
Type:Enzyme
Mol. Mass.:37557.19
Organism:Homo sapiens (Human)
Description:Purchased from Calbiochem (San Diego, CA).
Residue:333
BDBM50414641
NameBDBM50414641
Synonyms:CHEMBL554065
TypeSmall organic molecule
Emp. Form.C24H29N7O4
Mol. Mass.479.5316
SMILESCOCc1nnc(o1)-c1cccc(CC(NC(=O)c2cc(nn2C)C(C)(C)C)C(=O)NCC#N)c1