Reaction Details
TargetProcathepsin L
LigandBDBM50414636
Substrate/Competitorn/a
Meas. Tech.ChEMBL_581585 (CHEMBL1062472)
IC50 200±n/a nM
Citation Bethel, PAGerhardt, SJones, EVKenny, PWKaroutchi, GIMorley, ADOldham, KRankine, NAugustin, MKrapp, SSimader, HSteinbacher, S Design of selective Cathepsin inhibitors. Bioorg Med Chem Lett19:4622-5 (2009) 
 
Procathepsin L
Name:Procathepsin L
Type:Enzyme
Mol. Mass.:37557.19
Organism:Homo sapiens (Human)
Description:Purchased from Calbiochem (San Diego, CA).
Residue:333
BDBM50414636
NameBDBM50414636
Synonyms:CHEMBL559880
TypeSmall organic molecule
Emp. Form.C20H17N5O2S
Mol. Mass.391.446
SMILESO=C(NCC#N)C(Cc1cccc(c1)-c1nncs1)NC(=O)c1ccccc1