Reaction Details
Target5-hydroxytryptamine receptor 4
LigandBDBM50414669
Substrate/Competitorn/a
Meas. Tech.ChEMBL_583010 (CHEMBL1051848)
Ki 7.94±n/a nM
Citation McKinnell, RMArmstrong, SRBeattie, DTChoi, SKFatheree, PRGendron, RAGoldblum, AHumphrey, PPLong, DDMarquess, DGShaw, JPSmith, JATurner, SDVickery, RG A multivalent approach to the design and discovery of orally efficacious 5-HT4 receptor agonists. J Med Chem52:5330-43 (2009) 
 
5-hydroxytryptamine receptor 4
Name:5-hydroxytryptamine receptor 4
Type:Enzyme
Mol. Mass.:43767.54
Organism:Homo sapiens (Human)
Description:Q13639
Residue:388
BDBM50414669
NameBDBM50414669
Synonyms:CHEMBL552796
TypeSmall organic molecule
Emp. Form.C17H24N4O
Mol. Mass.300.3987
SMILESCC(C)n1nc(C(=O)NCC2CCNCC2)c2ccccc12