Reaction Details
Target5-hydroxytryptamine receptor 4
LigandBDBM50414735
Substrate/Competitorn/a
Meas. Tech.ChEMBL_583010 (CHEMBL1051848)
Ki 5.01±n/a nM
Citation McKinnell, RMArmstrong, SRBeattie, DTChoi, SKFatheree, PRGendron, RAGoldblum, AHumphrey, PPLong, DDMarquess, DGShaw, JPSmith, JATurner, SDVickery, RG A multivalent approach to the design and discovery of orally efficacious 5-HT4 receptor agonists. J Med Chem52:5330-43 (2009) 
 
5-hydroxytryptamine receptor 4
Name:5-hydroxytryptamine receptor 4
Type:Enzyme
Mol. Mass.:43767.54
Organism:Homo sapiens (Human)
Description:Q13639
Residue:388
BDBM50414735
NameBDBM50414735
Synonyms:CHEMBL555223
TypeSmall organic molecule
Emp. Form.C30H45N5O4S
Mol. Mass.571.774
SMILES[H][C@]12CC[C@]([H])(C[C@@H](C1)NC(=O)c1cc3ccccc3n(C(C)C)c1=O)N2CCCN1CCC(CNS(C)(=O)=O)CC1