Reaction Details
Target5-hydroxytryptamine receptor 4
LigandBDBM50414705
Substrate/Competitorn/a
Meas. Tech.ChEMBL_583010 (CHEMBL1051848)
Ki 3.16±n/a nM
Citation McKinnell, RMArmstrong, SRBeattie, DTChoi, SKFatheree, PRGendron, RAGoldblum, AHumphrey, PPLong, DDMarquess, DGShaw, JPSmith, JATurner, SDVickery, RG A multivalent approach to the design and discovery of orally efficacious 5-HT4 receptor agonists. J Med Chem52:5330-43 (2009) 
 
5-hydroxytryptamine receptor 4
Name:5-hydroxytryptamine receptor 4
Type:Enzyme
Mol. Mass.:43767.54
Organism:Homo sapiens (Human)
Description:Q13639
Residue:388
BDBM50414705
NameBDBM50414705
Synonyms:CHEMBL562636
TypeSmall organic molecule
Emp. Form.C26H43ClN4O2
Mol. Mass.479.098
SMILESCOc1cc(N)c(Cl)cc1C(=O)NC1CCN(CCCCCCCCN2CCCCC2)CC1