Reaction Details
Target5-hydroxytryptamine receptor 4
LigandBDBM50414695
Substrate/Competitorn/a
Meas. Tech.ChEMBL_583010 (CHEMBL1051848)
Ki 15.85±n/a nM
Citation McKinnell, RMArmstrong, SRBeattie, DTChoi, SKFatheree, PRGendron, RAGoldblum, AHumphrey, PPLong, DDMarquess, DGShaw, JPSmith, JATurner, SDVickery, RG A multivalent approach to the design and discovery of orally efficacious 5-HT4 receptor agonists. J Med Chem52:5330-43 (2009) 
 
5-hydroxytryptamine receptor 4
Name:5-hydroxytryptamine receptor 4
Type:Enzyme
Mol. Mass.:43767.54
Organism:Homo sapiens (Human)
Description:Q13639
Residue:388
BDBM50414695
NameBDBM50414695
Synonyms:CHEMBL559317
TypeSmall organic molecule
Emp. Form.C33H38N4O4
Mol. Mass.554.6792
SMILES[H][C@@]12CC[C@]([H])(CC(C1)NC(=O)c1cc3ccccc3n(C(C)C)c1=O)N2CCCCCN1C(=O)c2ccccc2C1=O