Reaction Details
TargetHistamine H3 receptor
LigandBDBM50414804
Substrate/Competitorn/a
Meas. Tech.ChEMBL_587793 (CHEMBL1042247)
Ki 0.617±n/a nM
Citation Dvorak, CAApodaca, RXiao, WJablonowski, JABonaventure, PDugovic, CShelton, JLord, BMiller, KDvorak, LKLovenberg, TWCarruthers, NI Diamine-based human histamine H3 receptor antagonists: (4-aminobutyn-1-yl)benzylamines. Eur J Med Chem44:4098-106 (2009) 
 
Histamine H3 receptor
Name:Histamine H3 receptor
Type:G Protein-Coupled Receptor (GPCR)
Mol. Mass.:48691.47
Organism:Homo sapiens (Human)
Description:Binding assays were using CHO cells stably expressing hH3R receptors.
Residue:445
BDBM50414804
NameBDBM50414804
Synonyms:CHEMBL574712
TypeSmall organic molecule
Emp. Form.C20H28N2
Mol. Mass.296.4497
SMILESC(CN1CCCCC1)C#Cc1ccc(CN2CCCC2)cc1