Reaction Details
TargetHistamine H3 receptor
LigandBDBM50414813
Substrate/Competitorn/a
Meas. Tech.ChEMBL_587793 (CHEMBL1042247)
Ki 0.871±n/a nM
Citation Dvorak, CAApodaca, RXiao, WJablonowski, JABonaventure, PDugovic, CShelton, JLord, BMiller, KDvorak, LKLovenberg, TWCarruthers, NI Diamine-based human histamine H3 receptor antagonists: (4-aminobutyn-1-yl)benzylamines. Eur J Med Chem44:4098-106 (2009) 
 
Histamine H3 receptor
Name:Histamine H3 receptor
Type:G Protein-Coupled Receptor (GPCR)
Mol. Mass.:48691.47
Organism:Homo sapiens (Human)
Description:Binding assays were using CHO cells stably expressing hH3R receptors.
Residue:445
BDBM50414813
NameBDBM50414813
Synonyms:CHEMBL573328
TypeSmall organic molecule
Emp. Form.C23H35N3
Mol. Mass.353.5441
SMILESCC(C)N1CCN(Cc2ccc(cc2)C#CCCN2CCCCC2)CC1