Reaction Details
TargetCoproporphyrinogen III oxidase
LigandBDBM50414814
Substrate/Competitorn/a
Meas. Tech.ChEMBL_588025 (CHEMBL1048360)
Ki 3311.31±n/a nM
Citation Zhang, LHao, GFTan, YXi, ZHuang, MZYang, GF Bioactive conformation analysis of cyclic imides as protoporphyrinogen oxidase inhibitor by combining DFT calculations, QSAR and molecular dynamic simulations. Bioorg Med Chem17:4935-42 (2009) 
 
Coproporphyrinogen III oxidase
Name:Coproporphyrinogen III oxidase
Type:PROTEIN
Mol. Mass.:51210.88
Organism:Bacillus subtilis (strain 168)
Description:ChEMBL_588025
Residue:470
BDBM50414814
NameBDBM50414814
Synonyms:CHEMBL576568
TypeSmall organic molecule
Emp. Form.C19H11FN2O4
Mol. Mass.350.3
SMILESFc1cc2OCC(=O)N(CC#C)c2cc1N1C(=O)c2ccccc2C1=O