Reaction Details
TargetCoproporphyrinogen III oxidase
LigandBDBM50414818
Substrate/Competitorn/a
Meas. Tech.ChEMBL_588025 (CHEMBL1048360)
Ki 4786.3±n/a nM
Citation Zhang, LHao, GFTan, YXi, ZHuang, MZYang, GF Bioactive conformation analysis of cyclic imides as protoporphyrinogen oxidase inhibitor by combining DFT calculations, QSAR and molecular dynamic simulations. Bioorg Med Chem17:4935-42 (2009) 
 
Coproporphyrinogen III oxidase
Name:Coproporphyrinogen III oxidase
Type:PROTEIN
Mol. Mass.:51210.88
Organism:Bacillus subtilis (strain 168)
Description:ChEMBL_588025
Residue:470
BDBM50414818
NameBDBM50414818
Synonyms:CHEMBL575228
TypeSmall organic molecule
Emp. Form.C21H15FN2O4
Mol. Mass.378.3532
SMILESCC1Oc2cc(F)c(cc2N(CC#C)C1=O)N1C(=O)c2ccc(C)cc2C1=O